hôtel
created: 2011-09-01T00:00:00+02:00
modified: 2014-12-31T12:22:24+01:00
status: 1
type: Concept
broader: T96-515
definition: Dans l'architecture classique, demeure citadine d'un grand seigneur ou d'un riche particulier, accompagnée généralement de communs, d'une cour et d'un jardin.
in scheme: T96
preferred label: town houses @en-us
scope note: Ne pas confondre avec hôtel de voyageurs.