immeuble à logements
created: 2011-09-01T00:00:00+02:00
modified: 2014-12-31T12:31:19+01:00
status: 1
type: Concept
broader: T96-515
definition: Edifice divisé à la construction en habitations juxtaposées à un ou plusieurs étages. Chaque logement dispose d’un accès particulier.
in scheme: T96
scope note: Ne pas confondre avec un immeuble desservi par des coursives en façade et disposant d’accès communs.