villa antique
created: 2011-09-01T00:00:00+02:00
modified: 2014-12-31T13:01:11+01:00
status: 1
type: Concept
broader: T96-515
definition: Au sens premier, maison de maître dans l'Antiquité romaine. La villa urbana est une résidence urbaine. La villa rustica comporte des dépendances agricoles.
definition: Réserver le sens actuel de villa (maison à caractère bourgeois entourée d'un jardin et munie de dépendances) pour préciser la désignation d’une demeure.
in scheme: T96