ensemble agricole
created: 2011-09-01T00:00:00+02:00
modified: 2014-12-30T14:08:39+01:00
status: 1
type: Concept
broad match: http://data.bnf.fr/ark:/12148/cb119581065
broader: T96-554
definition: Ensemble constitué d'édifices, édicules ou ouvrages à fonction agricole.
in scheme: T96
narrower: T96-556
narrower: T96-557
narrower: T96-558
narrower: T96-559
narrower: T96-560
narrower: T96-561
preferred label: agricultural complexes @en-us
scope note: Ne pas appeler ensemble agricole l'ensemble des fermes pouvant constituer des annexes d'un même domaine.