ensemble pastoral
created: 2011-09-01T00:00:00+02:00
modified: 2014-12-30T13:59:02+01:00
status: 1
type: Concept
broader: T96-555
definition: Ensemble constitué d'édifices, édicules et espaces à fonction pastorale.
in scheme: T96
narrow match: cb11947127p
preferred label: sheep farms @en-us