exploitation aquicole
created: 2011-09-01T00:00:00+02:00
modified: 2014-10-06T11:55:59+02:00
status: 1
type: Concept
alternative label: exploitation conchylicole
alternative label: exploitation ostréicole
alternative label: exploitation piscicole
broader: T96-555
definition: Installation d'élevage d'espèces animales en milieu aquatique (poissons, crustacés, coquillages) à des fins commerciales. Pour ce type d'exploitation, il est nécessaire de procéder à des aménagements en créant des parcs, des bassins, des enclos, des cages, des bacs, des remises, etc.
in scheme: T96