polder
created: 2011-09-01T00:00:00+02:00
modified: 2014-10-06T11:56:42+02:00
status: 1
type: Concept
broader: T96-555
definition: Territoire agricole entouré de digues, conquis sur le domaine maritime ou fluvial, souvent accompagné de canaux de draînage.
in scheme: T96
preferred label: polders @en-us