terrasse agricole
created: 2011-09-01T00:00:00+02:00
modified: 2014-12-30T14:07:10+01:00
status: 1
type: Concept
alternative label: terrasse de culture
broad match: http://vocab.getty.edu/aat/300004182
broader: T96-555
definition: Terrain aménagé par des levées de terre soutenues par des murets maçonnés ou en pierre sèche, afin de permettre des cultures en terrasses dans les sites à forte pente.
in scheme: T96
scope note: Ne pas employer en l'absence de mur de soutènement.