ferme
terme associe: T96-515
terme associe: T96-556
created: 2011-09-01T00:00:00+02:00
modified: 2014-12-30T13:52:01+01:00
status: 1
type: Concept
broader: T96-562
definition: Édifice comprenant un logis et les dépendances nécessaires à l'exploitation agricole.
in scheme: T96
narrow match: cb11952822w
narrower: T96-565
preferred label: farms @en-us
related: T96-515
related: T96-556
scope note: La ferme se distingue des autres maisons rurales par l'importance des espaces et des bâtiments consacrés à l'outillage agricole, au bétail et aux récoltes.