grange monastique
created: 2011-09-01T00:00:00+02:00
modified: 2014-12-30T13:49:45+01:00
status: 1
type: Concept
broader: T96-564
definition: Exploitation agricole dépendant d'une abbaye ou d'un prieuré, dont elle met les terres en valeur.
in scheme: T96
narrow match: Grange cistercienne
preferred label: granges (farms) @en-us
scope note: Il convient de préciser l'ordre religieux en désignation.