aire à battre
created: 2011-09-01T00:00:00+02:00
modified: 2014-12-30T14:12:14+01:00
status: 1
type: Concept
broader: T96-568
definition: Terrain aplani destiné au battage des céréales.
in scheme: T96
narrower: T96-571
preferred label: threshing floor @en-us