aire à battre couverte
created: 2011-09-01T00:00:00+02:00
modified: 2014-12-30T14:13:01+01:00
status: 1
type: Concept
broader: T96-570
definition: Aire à battre délimitée par des poteaux, fermée ou non, portant une toiture.
in scheme: T96