cuvage
terme associe: T96-828
created: 2011-09-01T00:00:00+02:00
modified: 2014-12-30T14:14:41+01:00
status: 1
type: Concept
broad match: http://data.bnf.fr/ark:/12148/cb121050197
broad match: http://vocab.getty.edu/aat/300387281
broader: T96-568
definition: Local ou aire aménagée où sont installées les machines à pressurer le raisin et les cuves de vinification.
in scheme: T96
related: T96-828