grange
terme associe: T96-266
created: 2011-09-01T00:00:00+02:00
modified: 2014-12-30T14:32:07+01:00
status: 1
type: Concept
broader: T96-568
definition: Bâtiment où l'on abrite la récolte de foin, de paille, etc.
in scheme: T96
preferred label: barns @en-us
related: T96-266