mare
created: 2011-09-01T00:00:00+02:00
modified: 2014-12-30T14:33:27+01:00
status: 1
type: Concept
broader: T96-568
definition: Étendue d'eau stagnante, naturelle ou artificielle, de petite superficie et de forme aléatoire.
in scheme: T96
preferred label: ponds (water) @en-us