pigeonnier
created: 2011-09-01T00:00:00+02:00
modified: 2014-12-30T14:35:56+01:00
status: 1
type: Concept
alternative label: fuie
broader: T96-568
definition: Construction servant d'abri pour les pigeons.
in scheme: T96
narrow match: Colombier (édifice)
narrower: T96-585
preferred label: dovecotes @en-us