colombier
created: 2011-09-01T00:00:00+02:00
modified: 2014-12-30T14:37:57+01:00
status: 1
type: Concept
alternative label: pigeonnier à pied
broader: T96-584
definition: En forme de tour, le colombier comprend une charpente formée d'un poteau central et d'une échelle tournante permettant d'atteindre les boulins abritant les pigeons.
in scheme: T96