pressoir
terme associe: T96-648
created: 2011-09-01T00:00:00+02:00
modified: 2014-12-30T14:43:23+01:00
status: 1
type: Concept
broader: T96-568
definition: Construction abritant une machine servant à extraire par pression les liquides que contiennent certains fruits ou graines.
in scheme: T96
narrow match: cb11974635k
narrower: T96-588
narrower: T96-589
narrower: T96-590
preferred label: presses (culinary tools) @en-us
related: T96-648