pressoir à cidre
created: 2011-09-01T00:00:00+02:00
modified: 2014-12-30T14:45:08+01:00
status: 1
type: Concept
broader: T96-587
definition: Pressoir à pommes en vue de la fabrication du cidre.
in scheme: T96
preferred label: cider presses @en-us