remise agricole
created: 2011-09-01T00:00:00+02:00
modified: 2014-12-30T14:49:41+01:00
status: 1
type: Concept
broad match: cb15582327q
broader: T96-568
definition: Local où l'on abrite les véhicules et l'outillage agricoles.
in scheme: T96
narrower: T96-592
scope note: Ne pas confondre avec hangar.