rucher
created: 2011-09-01T00:00:00+02:00
modified: 2014-12-30T14:52:39+01:00
status: 1
type: Concept
broader: T96-568
definition: Construction servant à la fabrication du miel, constituée de ruches qui contiennent les rayons où les abeilles déposent le miel. Les ruches sont installées à proximité d'arbres, de plantes ou de fleurs odoriférantes.
in scheme: T96
preferred label: apiaries @en-us