vivier
created: 2011-09-01T00:00:00+02:00
modified: 2014-12-30T14:55:24+01:00
status: 1
type: Concept
broader: T96-568
definition: Bassin ou étang pour l'élevage, l’engraissage ou la conservation des poissons et crustacés.
in scheme: T96
preferred label: fishponds @en-us