centre commercial
created: 2011-09-01T00:00:00+02:00
modified: 2014-12-05T11:24:58+01:00
status: 1
type: Concept
broader: T96-596
definition: Ensemble regroupant des magasins de détail comprenant généralement un magasin à grande surface, des boutiques ou commerces et divers services (telles poste, banque, etc.), et accompagné d'un ou plusieurs parcs de stationnement, dans une zone urbaine ou à proximité.
in scheme: T96
preferred label: shopping centers @en-us