agglomération
created: 2011-09-01T00:00:00+02:00
modified: 2015-01-07T11:52:24+01:00
status: 1
type: Concept
alternative label: ensemble urbain
alternative label: habitat
broader: T96-4
definition: Groupement de bâtiments pérennes ou éphémères présentant entre eux peu ou pas de discontinuité, pouvant être accompagnés d'autres aménagements de l'espace, de fonctions diverses ou non.
definition: Pour une ville débordant les limites communales, préférer le terme d'agglomération à celui de ville.
in scheme: T96
narrower: T96-10
narrower: T96-11
narrower: T96-14
narrower: T96-15
narrower: T96-16
narrower: T96-6
narrower: T96-7
narrower: T96-8
narrower: T96-9
preferred label: settlement @en-gb
preferred label: agglomerations @en-us