bourg
created: 2011-09-01T00:00:00+02:00
modified: 2015-01-07T11:28:31+01:00
status: 1
type: Concept
broader: T96-5
definition: Agglomération ou partie d'une agglomération médiévale ayant un statut juridique particulier et ne jouissant pas des privilèges de la cité. Aujourd'hui, agglomération de taille et de fonctions - notamment commerciales (lieu de marché) - intermédiaires entre le village et la ville.
in scheme: T96
narrow match: http://data.bnf.fr/ark:/12148/cb16252678f
preferred label: burgh @en-gb
preferred label: boroughs @en-us
preferred label: borgo @it