champ de foire
terme associe: T96-602
terme associe: T96-635
created: 2011-09-01T00:00:00+02:00
modified: 2014-12-05T11:22:29+01:00
status: 1
type: Concept
broader: T96-596
definition: Espace libre destiné à un grand marché public qui se tient à date fixe, avec une périodicité variable.
in scheme: T96
preferred label: fairgrounds @en-us
related: T96-602
related: T96-635