complexe hôtelier
created: 2011-09-01T00:00:00+02:00
modified: 2014-10-17T15:16:46+02:00
status: 1
type: Concept
broad match: Hôtel
broader: T96-596
definition: Complexe réunissant des édifices hôteliers et associés (restauration, pratique sportive, location de voitures, etc.).
in scheme: T96
preferred label: hotels (public accommodations) @en-us