abattoir
created: 2011-09-01T00:00:00+02:00
modified: 2014-12-04T14:55:33+01:00
status: 1
type: Concept
broader: T96-603
definition: Édifice ou partie d'édifice destiné à l'abattage des animaux de boucherie.
hidden label: abattoirs
in scheme: T96
narrower: T96-605
preferred label: slaughterhouses @en-us