boulangerie
created: 2011-09-01T00:00:00+02:00
modified: 2014-12-04T15:43:04+01:00
status: 1
type: Concept
broader: T96-603
definition: Édifice ou partie d'édifice artisanal où l'on fabrique et vend le pain.
in scheme: T96
preferred label: bakeries @en-us
scope note: Le décor de la boutique fait l’objet d’un dossier objet mobilier.