bourse de commerce
created: 2011-09-01T00:00:00+02:00
modified: 2014-10-06T13:02:34+02:00
status: 1
type: Concept
broader: T96-611
definition: Édifice où se concluent la vente et l'achat en gros de certaines marchandises.
in scheme: T96
preferred label: commodity exchanges @en-us