buvette
created: 2011-09-01T00:00:00+02:00
modified: 2014-10-06T13:07:03+02:00
status: 1
type: Concept
broader: T96-613
definition: Dans un espace public, édicule destiné à la vente de boissons ou de nourriture.
in scheme: T96