forge artisanale
terme associe: T96-713
created: 2011-09-01T00:00:00+02:00
modified: 2014-10-06T13:14:50+02:00
status: 1
type: Concept
broader: T96-603
definition: Édifice artisanal où l'on travaille les métaux au feu avec un marteau.
in scheme: T96
related: T96-713