fournil
terme associe: T96-1315
created: 2011-09-01T00:00:00+02:00
modified: 2014-12-04T16:05:42+01:00
status: 1
type: Concept
broader: T96-603
definition: Local (généralement de dimensions habitables) où l’on fabrique la pâte à pain et dans lequel se trouve le four.
in scheme: T96
related: T96-1315
scope note: Ne pas confondre avec four à pain.