garage de réparation automobile
terme associe: T96-644
created: 2011-09-01T00:00:00+02:00
modified: 2014-10-06T13:22:22+02:00
status: 1
type: Concept
broader: T96-603
definition: Édifice où sont effectués l'entretien, la réparation et éventuellement la vente des véhicules automobiles.
in scheme: T96
related: T96-644