hôtel de voyageurs
created: 2011-09-01T00:00:00+02:00
modified: 2014-12-04T16:33:01+01:00
status: 1
type: Concept
alternative label: hôtel de tourisme
broader: T96-603
definition: Édifice commercial destiné à loger des voyageurs. Il peut comprendre un restaurant.
in scheme: T96
preferred label: hotels @en-us
scope note: Ne pas confondre avec hôtellerie, ni avec hôtel.