laiterie
terme associe: T96-833
created: 2011-09-01T00:00:00+02:00
modified: 2014-12-04T16:44:21+01:00
status: 1
type: Concept
broader: T96-603
definition: Édifice ou local affecté à la collecte et à la fabrication du lait et du beurre.
in scheme: T96
preferred label: dairies @en-us
related: T96-833