magasin de commerce
terme associe: T96-650
created: 2011-09-01T00:00:00+02:00
modified: 2014-10-06T13:25:50+02:00
status: 1
type: Concept
broader: T96-603
definition: Édifice, bâtiment ou corps de bâtiment servant de lieu de dépôt, d'exposition et de vente de marchandises.
in scheme: T96
narrower: T96-627
narrower: T96-628
narrower: T96-629
narrower: T96-630
narrower: T96-631
narrower: T96-632
narrower: T96-633
preferred label: stores @en-us
related: T96-650
scope note: Ne pas confondre avec boutique.