hypermarché
created: 2011-09-01T00:00:00+02:00
modified: 2014-10-09T11:33:50+02:00
status: 1
type: Concept
broad match: cb11937759r
broad match: http://vocab.getty.edu/aat/300005246
broader: T96-626
definition: Magasin de plus de 2500 m2 de surface vendant en libre-service des denrées alimentaires et divers autres produits, et comportant des aires de stationnement.
in scheme: T96