superette
created: 2011-09-01T00:00:00+02:00
modified: 2014-12-05T10:19:00+01:00
status: 1
type: Concept
broader: T96-626
definition: Magasin d'alimentation et autres produits courants, en libre-service, d'une superficie comprise entre 120 et 400 m2.
in scheme: T96