marché couvert
created: 2011-09-01T00:00:00+02:00
modified: 2014-12-05T10:26:23+01:00
status: 1
type: Concept
alternative label: halles
broader: T96-635
definition: Espace couvert, généralement clos, abritant les étals des vendeurs d'un marché.
in scheme: T96
preferred label: market halls @en-us