poterie
created: 2011-09-01T00:00:00+02:00
modified: 2014-10-06T15:28:44+02:00
status: 1
type: Concept
broader: T96-603
definition: Édifice artisanal affecté à la fabrication d'objets et de récipients en céramique.
in scheme: T96
preferred label: potteries @en-us