refuge de montagne
created: 2011-09-01T00:00:00+02:00
modified: 2014-12-05T10:38:16+01:00
status: 1
type: Concept
alternative label: refuge
broad match: http://vocab.getty.edu/aat/300007688
broader: T96-603
definition: Édifice construit en haute ou moyenne montagne pour permettre aux alpinistes ou aux promeneurs de s'abriter en cas de mauvais temps, de prendre un repas ou de passer la nuit.
in scheme: T96
preferred label: shelters @en-us