relais de poste
created: 2011-09-01T00:00:00+02:00
modified: 2014-12-05T10:48:39+01:00
status: 1
type: Concept
alternative label: poste aux chevaux
broader: T96-603
definition: Relais de chevaux placés de distance en distance, afin d'assurer le transport des voyageurs et du courrier, où l’on peut être restauré et hébergé.
in scheme: T96
preferred label: posthouses @en-us