station service
terme associe: T96-622
created: 2011-09-01T00:00:00+02:00
modified: 2014-12-05T11:19:56+01:00
status: 1
type: Concept
broader: T96-603
definition: Établissement qui propose aux automobilistes des services divers : distribution de carburant, vente de produits destinés au bon fonctionnement, à l’entretien et à la réparation des véhicules, etc.
in scheme: T96
preferred label: service stations @en-us
related: T96-622