ensemble d'industrie extractive
created: 2011-09-01T00:00:00+02:00
modified: 2015-05-04T14:54:58+02:00
status: 1
type: Concept
broad match: cb11944497z
broad match: Catégorie:Industrie extractive
broader: T96-653
definition: Ensemble constitué d'usines liées à l'industrie extractive.
in scheme: T96