ensemble métallurgique
created: 2011-09-01T00:00:00+02:00
modified: 2015-05-04T15:30:40+02:00
status: 1
type: Concept
broad match: http://data.bnf.fr/ark:/12148/cb119766968
broad match: Métallurgie
broader: T96-653
definition: Ensemble constitué d'usines liées à la métallurgie.
in scheme: T96
narrower: T96-657
narrower: T96-658