ensemble de construction automobile
created: 2011-09-01T00:00:00+02:00
modified: 2015-05-04T15:09:48+02:00
status: 1
type: Concept
broad match: http://data.bnf.fr/ark:/12148/cb119470320
broad match: Construction automobile
broader: T96-659
definition: Ensemble constitué d'usines liées à la construction de véhicules automobiles.
in scheme: T96