ensemble de construction électrique
created: 2011-09-01T00:00:00+02:00
modified: 2015-05-04T14:58:51+02:00
status: 1
type: Concept
broader: T96-653
definition: Ensemble constitué d'usines liées à la construction électrique.
in scheme: T96