ensemble d'industrie agro-alimentaire
created: 2011-09-01T00:00:00+02:00
modified: 2015-05-04T14:38:26+02:00
status: 1
type: Concept
alternative label: ensemble d'industrie alimentaire
broad match: cb11949682p
broad match: Industrie agroalimentaire
broader: T96-653
definition: Ensemble constitué d'usines liées à l'industrie alimentaire.
in scheme: T96