usine
created: 2011-09-01T00:00:00+02:00
modified: 2015-02-09T15:23:28+01:00
status: 1
type: Concept
alternative label: édifice industriel
broader: T96-652
definition: Établissement industriel équipé de machines et destiné soit à la transformation des matières premières ou semi-ouvrées en produits finis, soit à la production d'énergie.
in scheme: T96
narrower: T96-676
narrower: T96-677
narrower: T96-686
narrower: T96-699
narrower: T96-720
narrower: T96-731
narrower: T96-740
narrower: T96-750
narrower: T96-756
narrower: T96-761
narrower: T96-768
narrower: T96-777
narrower: T96-783
narrower: T96-820
narrower: T96-857
narrower: T96-878
narrower: T96-891
narrower: T96-898
narrower: T96-913
narrower: T96-921
scope note: L'artisanat se distingue de l'industrie par les caractères suivants : petit nombre d'ouvriers, degré de mécanisation peu élevé, pas de production en grande série et généralement pas de commercialisation du produit hors d'une aire géographique restreinte.